{"text_format":"1","workbook":"xlsx","n_sheets":22,"sheets":["Forside","0.0","1.0","1.1","1.2","1.3","1.4","1.5","1.6","1.7","1.8","1.9","2.0","2.1","2.2","2.3","2.4","3.0","3.1","3.2","Uddannelsesoversigt","Reference"],"not_rendered":{"charts":0,"images":10,"macros":1,"external_links":0,"defined_names":25,"comments":0,"pivot_tables":0},"unopened":[],"bounds":{"document_bytes":16777216,"sheet_cells":100000,"rows_first":2000,"rows_last":500,"rows_between":2000,"halvings":0,"cell_chars":16384,"cell_head_chars":4096},"cells_cut":0,"cells_raw":0,"read":"whole","date_system":"1900"}

{"sheet":"Forside","index":0,"n_rows":32,"n_cols":15,"rows_kept":32,"cut":false,"hidden":false,"merged":[[8,1,8,3]]}
[]
[]
[]
[]
[]
[]
[]
[null,"Institutionsplan for (klik herunder for at anvende rullemenu til angivelse af institutionsnavn)"]
[null,"Københavns Universitet"]
[]
{"$rows_left_out":23}
{"sheet":"0.0","index":1,"n_rows":39,"n_cols":16,"rows_kept":39,"cut":false,"hidden":false,"merged":[[2,9,7,15],[33,9,36,15],[38,9,41,15]]}
[]
[]
[null,null,null,null,null,null,null,null,null,"OVERSIGT"]
[]
[]
[]
[]
[]
[null,null,null,null,null,null,null,null,null,{"$f":"IF(RIGHT(CELL(\"filnavn\"),3)=K9,_xlfn.UNICHAR(159),\"\")","v":""},{"$f":"INDEX(Links[ARKNAVN],ROW(K9)-ROW($K$9)+1)","v":"0.0"},{"$f":"HYPERLINK(INDEX(Links[LINK],MATCH(K9,Links[ARKNAVN],0)),INDEX(Links[OPGAVE],MATCH(K9,Links[ARKNAVN],0)))","v":"Overordnede overvejelser om opgaven"},null,null,null,{"$f":"IFERROR(INDEX(Forside!$O$17:$O$34,MATCH($K$9:$K$27,Forside!$L$17:$L$34,0)),\"\")","v":"Løst"}]
[null,null,null,null,null,null,null,null,null,{"$f":"IF(RIGHT(CELL(\"filnavn\"),3)=K10,_xlfn.UNICHAR(159),\"\")","v":""},{"$f":"INDEX(Links[ARKNAVN],ROW(K10)-ROW($K$9)+1)","v":"1.0"},{"$f":"HYPERLINK(INDEX(Links[LINK],MATCH(K10,Links[ARKNAVN],0)),INDEX(Links[OPGAVE],MATCH(K10,Links[ARKNAVN],0)))","v":"Indledning sektion 1"},null,null,null,{"$f":"IFERROR(INDEX(Forside!$O$17:$O$34,MATCH($K$9:$K$27,Forside!$L$17:$L$34,0)),\"\")","v":""}]
{"$rows_left_out":30}
{"sheet":"1.0","index":2,"n_rows":40,"n_cols":16,"rows_kept":40,"cut":false,"hidden":false,"merged":[[2,9,7,15],[29,9,32,15],[34,9,37,15],[39,9,42,15]]}
[]
[]
[null,null,null,null,null,null,null,null,null,"OVERSIGT"]
[]
[]
[]
[]
[]
[null,null,null,null,null,null,null,null,null,{"$f":"IF(RIGHT(CELL(\"filnavn\"),3)=K9,_xlfn.UNICHAR(159),\"\")","v":""},{"$f":"INDEX(Links[ARKNAVN],ROW(K9)-ROW($K$9)+1)","v":"0.0"},{"$f":"HYPERLINK(INDEX(Links[LINK],MATCH(K9,Links[ARKNAVN],0)),INDEX(Links[OPGAVE],MATCH(K9,Links[ARKNAVN],0)))","v":"Overordnede overvejelser om opgaven"},null,null,null,{"$f":"IFERROR(INDEX(Forside!$O$17:$O$34,MATCH($K$9:$K$27,Forside!$L$17:$L$34,0)),\"\")","v":"Løst"}]
[null,null,null,null,null,null,null,null,null,{"$f":"IF(RIGHT(CELL(\"filnavn\"),3)=K10,_xlfn.UNICHAR(159),\"\")","v":""},{"$f":"INDEX(Links[ARKNAVN],ROW(K10)-ROW($K$9)+1)","v":"1.0"},{"$f":"HYPERLINK(INDEX(Links[LINK],MATCH(K10,Links[ARKNAVN],0)),INDEX(Links[OPGAVE],MATCH(K10,Links[ARKNAVN],0)))","v":"Indledning sektion 1"},null,null,null,{"$f":"IFERROR(INDEX(Forside!$O$17:$O$34,MATCH($K$9:$K$27,Forside!$L$17:$L$34,0)),\"\")","v":""}]
{"$rows_left_out":31}
{"sheet":"1.1","index":3,"n_rows":40,"n_cols":16,"rows_kept":40,"cut":false,"hidden":false,"merged":[[2,9,7,15],[29,9,32,15],[34,9,37,15],[39,9,42,15]]}
[]
[]
[null,null,null,null,null,null,null,null,null,"OVERSIGT"]
[]
[]
[]
[]
[]
[null,null,null,null,null,null,null,null,null,{"$f":"IF(RIGHT(CELL(\"filnavn\"),3)=K9,_xlfn.UNICHAR(159),\"\")","v":""},{"$f":"INDEX(Links[ARKNAVN],ROW(K9)-ROW($K$9)+1)","v":"0.0"},{"$f":"HYPERLINK(INDEX(Links[LINK],MATCH(K9,Links[ARKNAVN],0)),INDEX(Links[OPGAVE],MATCH(K9,Links[ARKNAVN],0)))","v":"Overordnede overvejelser om opgaven"},null,null,null,{"$f":"IFERROR(INDEX(Forside!$O$17:$O$34,MATCH($K$9:$K$27,Forside!$L$17:$L$34,0)),\"\")","v":"Løst"}]
[null,null,null,null,null,null,null,null,null,{"$f":"IF(RIGHT(CELL(\"filnavn\"),3)=K10,_xlfn.UNICHAR(159),\"\")","v":""},{"$f":"INDEX(Links[ARKNAVN],ROW(K10)-ROW($K$9)+1)","v":"1.0"},{"$f":"HYPERLINK(INDEX(Links[LINK],MATCH(K10,Links[ARKNAVN],0)),INDEX(Links[OPGAVE],MATCH(K10,Links[ARKNAVN],0)))","v":"Indledning sektion 1"},null,null,null,{"$f":"IFERROR(INDEX(Forside!$O$17:$O$34,MATCH($K$9:$K$27,Forside!$L$17:$L$34,0)),\"\")","v":""}]
{"$rows_left_out":31}
{"sheet":"1.2","index":4,"n_rows":50,"n_cols":17,"rows_kept":50,"cut":false,"hidden":false,"merged":[[2,10,7,16],[29,10,32,16],[34,10,37,16],[39,10,42,16]]}
[]
[]
[null,null,null,null,null,null,null,null,null,null,"OVERSIGT"]
[]
[]
[]
[]
[]
[null,null,null,null,null,null,null,null,null,null,{"$f":"IF(RIGHT(CELL(\"filnavn\"),3)=L9,_xlfn.UNICHAR(159),\"\")","v":""},{"$f":"INDEX(Links[ARKNAVN],ROW(L9)-ROW($K$9)+1)","v":"0.0"},{"$f":"HYPERLINK(INDEX(Links[LINK],MATCH(L9,Links[ARKNAVN],0)),INDEX(Links[OPGAVE],MATCH(L9,Links[ARKNAVN],0)))","v":"Overordnede overvejelser om opgaven"},null,null,null,{"$f":"IFERROR(INDEX(Forside!$O$17:$O$34,MATCH($L$9:$L$27,Forside!$L$17:$L$34,0)),\"\")","v":"Løst"}]
[null,null,null,null,null,null,null,null,null,null,{"$f":"IF(RIGHT(CELL(\"filnavn\"),3)=L10,_xlfn.UNICHAR(159),\"\")","v":""},{"$f":"INDEX(Links[ARKNAVN],ROW(L10)-ROW($K$9)+1)","v":"1.0"},{"$f":"HYPERLINK(INDEX(Links[LINK],MATCH(L10,Links[ARKNAVN],0)),INDEX(Links[OPGAVE],MATCH(L10,Links[ARKNAVN],0)))","v":"Indledning sektion 1"},null,null,null,{"$f":"IFERROR(INDEX(Forside!$O$17:$O$34,MATCH($L$9:$L$27,Forside!$L$17:$L$34,0)),\"\")","v":""}]
{"$rows_left_out":41}
{"sheet":"1.3","index":5,"n_rows":50,"n_cols":16,"rows_kept":50,"cut":false,"hidden":false,"merged":[[2,9,7,15],[29,9,32,15],[34,9,37,15],[39,9,42,15]]}
[]
[]
[null,null,null,null,null,null,null,null,null,"OVERSIGT"]
[]
[]
[]
[]
[]
[null,null,null,null,null,null,null,null,null,{"$f":"IF(RIGHT(CELL(\"filnavn\"),3)=K9,_xlfn.UNICHAR(159),\"\")","v":""},{"$f":"INDEX(Links[ARKNAVN],ROW(K9)-ROW($K$9)+1)","v":"0.0"},{"$f":"HYPERLINK(INDEX(Links[LINK],MATCH(K9,Links[ARKNAVN],0)),INDEX(Links[OPGAVE],MATCH(K9,Links[ARKNAVN],0)))","v":"Overordnede overvejelser om opgaven"},null,null,null,{"$f":"IFERROR(INDEX(Forside!$O$17:$O$34,MATCH($K$9:$K$27,Forside!$L$17:$L$34,0)),\"\")","v":"Løst"}]
[null,null,null,null,null,null,null,null,null,{"$f":"IF(RIGHT(CELL(\"filnavn\"),3)=K10,_xlfn.UNICHAR(159),\"\")","v":""},{"$f":"INDEX(Links[ARKNAVN],ROW(K10)-ROW($K$9)+1)","v":"1.0"},{"$f":"HYPERLINK(INDEX(Links[LINK],MATCH(K10,Links[ARKNAVN],0)),INDEX(Links[OPGAVE],MATCH(K10,Links[ARKNAVN],0)))","v":"Indledning sektion 1"},null,null,null,{"$f":"IFERROR(INDEX(Forside!$O$17:$O$34,MATCH($K$9:$K$27,Forside!$L$17:$L$34,0)),\"\")","v":""}]
{"$rows_left_out":41}
{"sheet":"1.4","index":6,"n_rows":50,"n_cols":16,"rows_kept":50,"cut":false,"hidden":false,"merged":[[2,9,7,15],[29,9,32,15],[34,9,37,15],[39,9,42,15]]}
[]
[]
[null,null,null,null,null,null,null,null,null,"OVERSIGT"]
[]
[]
[]
[]
[]
[null,null,null,null,null,null,null,null,null,{"$f":"IF(RIGHT(CELL(\"filnavn\"),3)=K9,_xlfn.UNICHAR(159),\"\")","v":""},{"$f":"INDEX(Links[ARKNAVN],ROW(K9)-ROW($K$9)+1)","v":"0.0"},{"$f":"HYPERLINK(INDEX(Links[LINK],MATCH(K9,Links[ARKNAVN],0)),INDEX(Links[OPGAVE],MATCH(K9,Links[ARKNAVN],0)))","v":"Overordnede overvejelser om opgaven"},null,null,null,{"$f":"IFERROR(INDEX(Forside!$O$17:$O$34,MATCH($K$9:$K$27,Forside!$L$17:$L$34,0)),\"\")","v":"Løst"}]
[null,null,null,null,null,null,null,null,null,{"$f":"IF(RIGHT(CELL(\"filnavn\"),3)=K10,_xlfn.UNICHAR(159),\"\")","v":""},{"$f":"INDEX(Links[ARKNAVN],ROW(K10)-ROW($K$9)+1)","v":"1.0"},{"$f":"HYPERLINK(INDEX(Links[LINK],MATCH(K10,Links[ARKNAVN],0)),INDEX(Links[OPGAVE],MATCH(K10,Links[ARKNAVN],0)))","v":"Indledning sektion 1"},null,null,null,{"$f":"IFERROR(INDEX(Forside!$O$17:$O$34,MATCH($K$9:$K$27,Forside!$L$17:$L$34,0)),\"\")","v":""}]
{"$rows_left_out":41}
{"sheet":"1.5","index":7,"n_rows":40,"n_cols":16,"rows_kept":40,"cut":false,"hidden":false,"merged":[[2,9,7,15],[29,9,32,15],[34,9,37,15],[39,9,42,15]]}
[]
[]
[null,null,null,null,null,null,null,null,null,"OVERSIGT"]
[]
[]
[]
[]
[]
[null,null,null,null,null,null,null,null,null,{"$f":"IF(RIGHT(CELL(\"filnavn\"),3)=K9,_xlfn.UNICHAR(159),\"\")","v":""},{"$f":"INDEX(Links[ARKNAVN],ROW(K9)-ROW($K$9)+1)","v":"0.0"},{"$f":"HYPERLINK(INDEX(Links[LINK],MATCH(K9,Links[ARKNAVN],0)),INDEX(Links[OPGAVE],MATCH(K9,Links[ARKNAVN],0)))","v":"Overordnede overvejelser om opgaven"},null,null,null,{"$f":"IFERROR(INDEX(Forside!$O$17:$O$34,MATCH($K$9:$K$27,Forside!$L$17:$L$34,0)),\"\")","v":"Løst"}]
[null,null,null,null,null,null,null,null,null,{"$f":"IF(RIGHT(CELL(\"filnavn\"),3)=K10,_xlfn.UNICHAR(159),\"\")","v":""},{"$f":"INDEX(Links[ARKNAVN],ROW(K10)-ROW($K$9)+1)","v":"1.0"},{"$f":"HYPERLINK(INDEX(Links[LINK],MATCH(K10,Links[ARKNAVN],0)),INDEX(Links[OPGAVE],MATCH(K10,Links[ARKNAVN],0)))","v":"Indledning sektion 1"},null,null,null,{"$f":"IFERROR(INDEX(Forside!$O$17:$O$34,MATCH($K$9:$K$27,Forside!$L$17:$L$34,0)),\"\")","v":""}]
{"$rows_left_out":31}
{"sheet":"1.6","index":8,"n_rows":50,"n_cols":16,"rows_kept":50,"cut":false,"hidden":false,"merged":[[2,9,7,15],[29,9,32,15],[34,9,37,15],[39,9,42,15]]}
[]
[]
[null,null,null,null,null,null,null,null,null,"OVERSIGT"]
[]
[]
[]
[]
[]
[null,null,null,null,null,null,null,null,null,{"$f":"IF(RIGHT(CELL(\"filnavn\"),3)=K9,_xlfn.UNICHAR(159),\"\")","v":""},{"$f":"INDEX(Links[ARKNAVN],ROW(K9)-ROW($K$9)+1)","v":"0.0"},{"$f":"HYPERLINK(INDEX(Links[LINK],MATCH(K9,Links[ARKNAVN],0)),INDEX(Links[OPGAVE],MATCH(K9,Links[ARKNAVN],0)))","v":"Overordnede overvejelser om opgaven"},null,null,null,{"$f":"IFERROR(INDEX(Forside!$O$17:$O$34,MATCH($K$9:$K$27,Forside!$L$17:$L$34,0)),\"\")","v":"Løst"}]
[null,null,null,null,null,null,null,null,null,{"$f":"IF(RIGHT(CELL(\"filnavn\"),3)=K10,_xlfn.UNICHAR(159),\"\")","v":""},{"$f":"INDEX(Links[ARKNAVN],ROW(K10)-ROW($K$9)+1)","v":"1.0"},{"$f":"HYPERLINK(INDEX(Links[LINK],MATCH(K10,Links[ARKNAVN],0)),INDEX(Links[OPGAVE],MATCH(K10,Links[ARKNAVN],0)))","v":"Indledning sektion 1"},null,null,null,{"$f":"IFERROR(INDEX(Forside!$O$17:$O$34,MATCH($K$9:$K$27,Forside!$L$17:$L$34,0)),\"\")","v":""}]
{"$rows_left_out":41}
{"sheet":"1.7","index":9,"n_rows":40,"n_cols":16,"rows_kept":40,"cut":false,"hidden":false,"merged":[[2,9,7,15],[29,9,32,15],[34,9,37,15],[39,9,42,15]]}
[]
[]
[null,null,null,null,null,null,null,null,null,"OVERSIGT"]
[]
[]
[]
[]
[]
[null,null,null,null,null,null,null,null,null,{"$f":"IF(RIGHT(CELL(\"filnavn\"),3)=K9,_xlfn.UNICHAR(159),\"\")","v":""},{"$f":"INDEX(Links[ARKNAVN],ROW(K9)-ROW($K$9)+1)","v":"0.0"},{"$f":"HYPERLINK(INDEX(Links[LINK],MATCH(K9,Links[ARKNAVN],0)),INDEX(Links[OPGAVE],MATCH(K9,Links[ARKNAVN],0)))","v":"Overordnede overvejelser om opgaven"},null,null,null,{"$f":"IFERROR(INDEX(Forside!$O$17:$O$34,MATCH($K$9:$K$27,Forside!$L$17:$L$34,0)),\"\")","v":"Løst"}]
[null,null,null,null,null,null,null,null,null,{"$f":"IF(RIGHT(CELL(\"filnavn\"),3)=K10,_xlfn.UNICHAR(159),\"\")","v":""},{"$f":"INDEX(Links[ARKNAVN],ROW(K10)-ROW($K$9)+1)","v":"1.0"},{"$f":"HYPERLINK(INDEX(Links[LINK],MATCH(K10,Links[ARKNAVN],0)),INDEX(Links[OPGAVE],MATCH(K10,Links[ARKNAVN],0)))","v":"Indledning sektion 1"},null,null,null,{"$f":"IFERROR(INDEX(Forside!$O$17:$O$34,MATCH($K$9:$K$27,Forside!$L$17:$L$34,0)),\"\")","v":""}]
{"$rows_left_out":31}
{"sheet":"1.8","index":10,"n_rows":50,"n_cols":15,"rows_kept":50,"cut":false,"hidden":false,"merged":[[2,8,7,14],[29,8,32,14],[34,8,37,14],[39,8,42,14]]}
[]
[]
[null,null,null,null,null,null,null,null,"OVERSIGT"]
[]
[]
[]
[]
[]
[null,null,null,null,null,null,null,null,{"$f":"IF(RIGHT(CELL(\"filnavn\"),3)=J9,_xlfn.UNICHAR(159),\"\")","v":""},{"$f":"INDEX(Links[ARKNAVN],ROW(J9)-ROW($K$9)+1)","v":"0.0"},{"$f":"HYPERLINK(INDEX(Links[LINK],MATCH(J9,Links[ARKNAVN],0)),INDEX(Links[OPGAVE],MATCH(J9,Links[ARKNAVN],0)))","v":"Overordnede overvejelser om opgaven"},null,null,null,{"$f":"IFERROR(INDEX(Forside!$O$17:$O$34,MATCH($J$9:$J$27,Forside!$L$17:$L$34,0)),\"\")","v":"Løst"}]
[null,null,null,null,null,null,null,null,{"$f":"IF(RIGHT(CELL(\"filnavn\"),3)=J10,_xlfn.UNICHAR(159),\"\")","v":""},{"$f":"INDEX(Links[ARKNAVN],ROW(J10)-ROW($K$9)+1)","v":"1.0"},{"$f":"HYPERLINK(INDEX(Links[LINK],MATCH(J10,Links[ARKNAVN],0)),INDEX(Links[OPGAVE],MATCH(J10,Links[ARKNAVN],0)))","v":"Indledning sektion 1"},null,null,null,{"$f":"IFERROR(INDEX(Forside!$O$17:$O$34,MATCH($J$9:$J$27,Forside!$L$17:$L$34,0)),\"\")","v":""}]
{"$rows_left_out":41}
{"sheet":"1.9","index":11,"n_rows":40,"n_cols":16,"rows_kept":40,"cut":false,"hidden":false,"merged":[[2,9,7,15],[29,9,32,15],[34,9,37,15],[39,9,42,15]]}
[]
[]
[null,null,null,null,null,null,null,null,null,"OVERSIGT"]
[]
[]
[]
[]
[]
[null,null,null,null,null,null,null,null,null,{"$f":"IF(RIGHT(CELL(\"filnavn\"),3)=K9,_xlfn.UNICHAR(159),\"\")","v":""},{"$f":"INDEX(Links[ARKNAVN],ROW(K9)-ROW($K$9)+1)","v":"0.0"},{"$f":"HYPERLINK(INDEX(Links[LINK],MATCH(K9,Links[ARKNAVN],0)),INDEX(Links[OPGAVE],MATCH(K9,Links[ARKNAVN],0)))","v":"Overordnede overvejelser om opgaven"},null,null,null,{"$f":"IFERROR(INDEX(Forside!$O$17:$O$34,MATCH($K$9:$K$27,Forside!$L$17:$L$34,0)),\"\")","v":"Løst"}]
[null,null,null,null,null,null,null,null,null,{"$f":"IF(RIGHT(CELL(\"filnavn\"),3)=K10,_xlfn.UNICHAR(159),\"\")","v":""},{"$f":"INDEX(Links[ARKNAVN],ROW(K10)-ROW($K$9)+1)","v":"1.0"},{"$f":"HYPERLINK(INDEX(Links[LINK],MATCH(K10,Links[ARKNAVN],0)),INDEX(Links[OPGAVE],MATCH(K10,Links[ARKNAVN],0)))","v":"Indledning sektion 1"},null,null,null,{"$f":"IFERROR(INDEX(Forside!$O$17:$O$34,MATCH($K$9:$K$27,Forside!$L$17:$L$34,0)),\"\")","v":""}]
{"$rows_left_out":31}
{"sheet":"2.0","index":12,"n_rows":40,"n_cols":16,"rows_kept":40,"cut":false,"hidden":false,"merged":[[2,9,7,15],[29,9,32,15],[34,9,37,15],[39,9,42,15]]}
[]
[]
[null,null,null,null,null,null,null,null,null,"OVERSIGT"]
[]
[]
[]
[]
[]
[null,null,null,null,null,null,null,null,null,{"$f":"IF(RIGHT(CELL(\"filnavn\"),3)=K9,_xlfn.UNICHAR(159),\"\")","v":""},{"$f":"INDEX(Links[ARKNAVN],ROW(K9)-ROW($K$9)+1)","v":"0.0"},{"$f":"HYPERLINK(INDEX(Links[LINK],MATCH(K9,Links[ARKNAVN],0)),INDEX(Links[OPGAVE],MATCH(K9,Links[ARKNAVN],0)))","v":"Overordnede overvejelser om opgaven"},null,null,null,{"$f":"IFERROR(INDEX(Forside!$O$17:$O$34,MATCH($K$9:$K$27,Forside!$L$17:$L$34,0)),\"\")","v":"Løst"}]
[null,null,null,null,null,null,null,null,null,{"$f":"IF(RIGHT(CELL(\"filnavn\"),3)=K10,_xlfn.UNICHAR(159),\"\")","v":""},{"$f":"INDEX(Links[ARKNAVN],ROW(K10)-ROW($K$9)+1)","v":"1.0"},{"$f":"HYPERLINK(INDEX(Links[LINK],MATCH(K10,Links[ARKNAVN],0)),INDEX(Links[OPGAVE],MATCH(K10,Links[ARKNAVN],0)))","v":"Indledning sektion 1"},null,null,null,{"$f":"IFERROR(INDEX(Forside!$O$17:$O$34,MATCH($K$9:$K$27,Forside!$L$17:$L$34,0)),\"\")","v":""}]
{"$rows_left_out":31}
{"sheet":"2.1","index":13,"n_rows":40,"n_cols":16,"rows_kept":40,"cut":false,"hidden":false,"merged":[[2,9,7,15],[29,9,32,15],[34,9,37,15],[39,9,42,15]]}
[]
[]
[null,null,null,null,null,null,null,null,null,"OVERSIGT"]
[]
[]
[]
[]
[]
[null,null,null,null,null,null,null,null,null,{"$f":"IF(RIGHT(CELL(\"filnavn\"),3)=K9,_xlfn.UNICHAR(159),\"\")","v":""},{"$f":"INDEX(Links[ARKNAVN],ROW(K9)-ROW($K$9)+1)","v":"0.0"},{"$f":"HYPERLINK(INDEX(Links[LINK],MATCH(K9,Links[ARKNAVN],0)),INDEX(Links[OPGAVE],MATCH(K9,Links[ARKNAVN],0)))","v":"Overordnede overvejelser om opgaven"},null,null,null,{"$f":"IFERROR(INDEX(Forside!$O$17:$O$34,MATCH($K$9:$K$27,Forside!$L$17:$L$34,0)),\"\")","v":"Løst"}]
[null,null,null,null,null,null,null,null,null,{"$f":"IF(RIGHT(CELL(\"filnavn\"),3)=K10,_xlfn.UNICHAR(159),\"\")","v":""},{"$f":"INDEX(Links[ARKNAVN],ROW(K10)-ROW($K$9)+1)","v":"1.0"},{"$f":"HYPERLINK(INDEX(Links[LINK],MATCH(K10,Links[ARKNAVN],0)),INDEX(Links[OPGAVE],MATCH(K10,Links[ARKNAVN],0)))","v":"Indledning sektion 1"},null,null,null,{"$f":"IFERROR(INDEX(Forside!$O$17:$O$34,MATCH($K$9:$K$27,Forside!$L$17:$L$34,0)),\"\")","v":""}]
{"$rows_left_out":31}
{"sheet":"2.2","index":14,"n_rows":50,"n_cols":16,"rows_kept":50,"cut":false,"hidden":false,"merged":[[2,9,7,15],[29,9,32,15],[34,9,37,15],[39,9,42,15]]}
[]
[]
[null,null,null,null,null,null,null,null,null,"OVERSIGT"]
[]
[]
[]
[]
[]
[null,null,null,null,null,null,null,null,null,{"$f":"IF(RIGHT(CELL(\"filnavn\"),3)=K9,_xlfn.UNICHAR(159),\"\")","v":""},{"$f":"INDEX(Links[ARKNAVN],ROW(K9)-ROW($K$9)+1)","v":"0.0"},{"$f":"HYPERLINK(INDEX(Links[LINK],MATCH(K9,Links[ARKNAVN],0)),INDEX(Links[OPGAVE],MATCH(K9,Links[ARKNAVN],0)))","v":"Overordnede overvejelser om opgaven"},null,null,null,{"$f":"IFERROR(INDEX(Forside!$O$17:$O$34,MATCH($K$9:$K$27,Forside!$L$17:$L$34,0)),\"\")","v":"Løst"}]
[null,null,null,null,null,null,null,null,null,{"$f":"IF(RIGHT(CELL(\"filnavn\"),3)=K10,_xlfn.UNICHAR(159),\"\")","v":""},{"$f":"INDEX(Links[ARKNAVN],ROW(K10)-ROW($K$9)+1)","v":"1.0"},{"$f":"HYPERLINK(INDEX(Links[LINK],MATCH(K10,Links[ARKNAVN],0)),INDEX(Links[OPGAVE],MATCH(K10,Links[ARKNAVN],0)))","v":"Indledning sektion 1"},null,null,null,{"$f":"IFERROR(INDEX(Forside!$O$17:$O$34,MATCH($K$9:$K$27,Forside!$L$17:$L$34,0)),\"\")","v":""}]
{"$rows_left_out":41}
{"sheet":"2.3","index":15,"n_rows":40,"n_cols":16,"rows_kept":40,"cut":false,"hidden":false,"merged":[[2,9,7,15],[29,9,32,15],[34,9,37,15],[39,9,42,15]]}
[]
[]
[null,null,null,null,null,null,null,null,null,"OVERSIGT"]
[]
[]
[]
[]
[]
[null,null,null,null,null,null,null,null,null,{"$f":"IF(RIGHT(CELL(\"filnavn\"),3)=K9,_xlfn.UNICHAR(159),\"\")","v":""},{"$f":"INDEX(Links[ARKNAVN],ROW(K9)-ROW($K$9)+1)","v":"0.0"},{"$f":"HYPERLINK(INDEX(Links[LINK],MATCH(K9,Links[ARKNAVN],0)),INDEX(Links[OPGAVE],MATCH(K9,Links[ARKNAVN],0)))","v":"Overordnede overvejelser om opgaven"},null,null,null,{"$f":"IFERROR(INDEX(Forside!$O$17:$O$34,MATCH($K$9:$K$27,Forside!$L$17:$L$34,0)),\"\")","v":"Løst"}]
[null,null,null,null,null,null,null,null,null,{"$f":"IF(RIGHT(CELL(\"filnavn\"),3)=K10,_xlfn.UNICHAR(159),\"\")","v":""},{"$f":"INDEX(Links[ARKNAVN],ROW(K10)-ROW($K$9)+1)","v":"1.0"},{"$f":"HYPERLINK(INDEX(Links[LINK],MATCH(K10,Links[ARKNAVN],0)),INDEX(Links[OPGAVE],MATCH(K10,Links[ARKNAVN],0)))","v":"Indledning sektion 1"},null,null,null,{"$f":"IFERROR(INDEX(Forside!$O$17:$O$34,MATCH($K$9:$K$27,Forside!$L$17:$L$34,0)),\"\")","v":""}]
{"$rows_left_out":31}
{"sheet":"2.4","index":16,"n_rows":40,"n_cols":16,"rows_kept":40,"cut":false,"hidden":false,"merged":[[2,9,7,15],[29,9,32,15],[34,9,37,15],[39,9,42,15]]}
[]
[]
[null,null,null,null,null,null,null,null,null,"OVERSIGT"]
[]
[]
[]
[]
[]
[null,null,null,null,null,null,null,null,null,{"$f":"IF(RIGHT(CELL(\"filnavn\"),3)=K9,_xlfn.UNICHAR(159),\"\")","v":""},{"$f":"INDEX(Links[ARKNAVN],ROW(K9)-ROW($K$9)+1)","v":"0.0"},{"$f":"HYPERLINK(INDEX(Links[LINK],MATCH(K9,Links[ARKNAVN],0)),INDEX(Links[OPGAVE],MATCH(K9,Links[ARKNAVN],0)))","v":"Overordnede overvejelser om opgaven"},null,null,null,{"$f":"IFERROR(INDEX(Forside!$O$17:$O$34,MATCH($K$9:$K$27,Forside!$L$17:$L$34,0)),\"\")","v":"Løst"}]
[null,null,null,null,null,null,null,null,null,{"$f":"IF(RIGHT(CELL(\"filnavn\"),3)=K10,_xlfn.UNICHAR(159),\"\")","v":""},{"$f":"INDEX(Links[ARKNAVN],ROW(K10)-ROW($K$9)+1)","v":"1.0"},{"$f":"HYPERLINK(INDEX(Links[LINK],MATCH(K10,Links[ARKNAVN],0)),INDEX(Links[OPGAVE],MATCH(K10,Links[ARKNAVN],0)))","v":"Indledning sektion 1"},null,null,null,{"$f":"IFERROR(INDEX(Forside!$O$17:$O$34,MATCH($K$9:$K$27,Forside!$L$17:$L$34,0)),\"\")","v":""}]
{"$rows_left_out":31}
{"sheet":"3.0","index":17,"n_rows":40,"n_cols":16,"rows_kept":40,"cut":false,"hidden":false,"merged":[[2,9,7,15],[29,9,32,15],[34,9,37,15],[39,9,42,15]]}
[]
[]
[null,null,null,null,null,null,null,null,null,"OVERSIGT"]
[]
[]
[]
[]
[]
[null,null,null,null,null,null,null,null,null,{"$f":"IF(RIGHT(CELL(\"filnavn\"),3)=K9,_xlfn.UNICHAR(159),\"\")","v":""},{"$f":"INDEX(Links[ARKNAVN],ROW(K9)-ROW($K$9)+1)","v":"0.0"},{"$f":"HYPERLINK(INDEX(Links[LINK],MATCH(K9,Links[ARKNAVN],0)),INDEX(Links[OPGAVE],MATCH(K9,Links[ARKNAVN],0)))","v":"Overordnede overvejelser om opgaven"},null,null,null,{"$f":"IFERROR(INDEX(Forside!$O$17:$O$34,MATCH($K$9:$K$27,Forside!$L$17:$L$34,0)),\"\")","v":"Løst"}]
[null,null,null,null,null,null,null,null,null,{"$f":"IF(RIGHT(CELL(\"filnavn\"),3)=K10,_xlfn.UNICHAR(159),\"\")","v":""},{"$f":"INDEX(Links[ARKNAVN],ROW(K10)-ROW($K$9)+1)","v":"1.0"},{"$f":"HYPERLINK(INDEX(Links[LINK],MATCH(K10,Links[ARKNAVN],0)),INDEX(Links[OPGAVE],MATCH(K10,Links[ARKNAVN],0)))","v":"Indledning sektion 1"},null,null,null,{"$f":"IFERROR(INDEX(Forside!$O$17:$O$34,MATCH($K$9:$K$27,Forside!$L$17:$L$34,0)),\"\")","v":""}]
{"$rows_left_out":31}
{"sheet":"3.1","index":18,"n_rows":50,"n_cols":15,"rows_kept":50,"cut":false,"hidden":false,"merged":[[2,8,7,14],[29,8,32,14],[34,8,37,14],[39,8,42,14]]}
[]
[]
[null,null,null,null,null,null,null,null,"OVERSIGT"]
[]
[]
[]
[]
[]
[null,null,null,null,null,null,null,null,{"$f":"IF(RIGHT(CELL(\"filnavn\"),3)=J9,_xlfn.UNICHAR(159),\"\")","v":""},{"$f":"INDEX(Links[ARKNAVN],ROW(J9)-ROW($K$9)+1)","v":"0.0"},{"$f":"HYPERLINK(INDEX(Links[LINK],MATCH(J9,Links[ARKNAVN],0)),INDEX(Links[OPGAVE],MATCH(J9,Links[ARKNAVN],0)))","v":"Overordnede overvejelser om opgaven"},null,null,null,{"$f":"IFERROR(INDEX(Forside!$O$17:$O$34,MATCH($J$9:$J$27,Forside!$L$17:$L$34,0)),\"\")","v":"Løst"}]
[null,null,null,null,null,null,null,null,{"$f":"IF(RIGHT(CELL(\"filnavn\"),3)=J10,_xlfn.UNICHAR(159),\"\")","v":""},{"$f":"INDEX(Links[ARKNAVN],ROW(J10)-ROW($K$9)+1)","v":"1.0"},{"$f":"HYPERLINK(INDEX(Links[LINK],MATCH(J10,Links[ARKNAVN],0)),INDEX(Links[OPGAVE],MATCH(J10,Links[ARKNAVN],0)))","v":"Indledning sektion 1"},null,null,null,{"$f":"IFERROR(INDEX(Forside!$O$17:$O$34,MATCH($J$9:$J$27,Forside!$L$17:$L$34,0)),\"\")","v":""}]
{"$rows_left_out":41}
{"sheet":"3.2","index":19,"n_rows":39,"n_cols":16,"rows_kept":39,"cut":false,"hidden":false,"merged":[[2,9,7,15],[33,9,36,15],[38,9,41,15]]}
[]
[]
[null,null,null,null,null,null,null,null,null,"OVERSIGT"]
[]
[]
[]
[]
[]
[null,null,null,null,null,null,null,null,null,{"$f":"IF(RIGHT(CELL(\"filnavn\"),3)=K9,_xlfn.UNICHAR(159),\"\")","v":""},{"$f":"INDEX(Links[ARKNAVN],ROW(K9)-ROW($K$9)+1)","v":"0.0"},{"$f":"HYPERLINK(INDEX(Links[LINK],MATCH(K9,Links[ARKNAVN],0)),INDEX(Links[OPGAVE],MATCH(K9,Links[ARKNAVN],0)))","v":"Overordnede overvejelser om opgaven"},null,null,null,{"$f":"IFERROR(INDEX(Forside!$O$17:$O$34,MATCH($K$9:$K$27,Forside!$L$17:$L$34,0)),\"\")","v":"Løst"}]
[null,null,null,null,null,null,null,null,null,{"$f":"IF(RIGHT(CELL(\"filnavn\"),3)=K10,_xlfn.UNICHAR(159),\"\")","v":""},{"$f":"INDEX(Links[ARKNAVN],ROW(K10)-ROW($K$9)+1)","v":"1.0"},{"$f":"HYPERLINK(INDEX(Links[LINK],MATCH(K10,Links[ARKNAVN],0)),INDEX(Links[OPGAVE],MATCH(K10,Links[ARKNAVN],0)))","v":"Indledning sektion 1"},null,null,null,{"$f":"IFERROR(INDEX(Forside!$O$17:$O$34,MATCH($K$9:$K$27,Forside!$L$17:$L$34,0)),\"\")","v":""}]
{"$rows_left_out":30}
{"sheet":"Uddannelsesoversigt","index":20,"n_rows":1273,"n_cols":5,"rows_kept":1273,"cut":false,"hidden":false,"merged":[]}
[]
[]
[]
[]
[]
[]
[]
[]
[]
[]
{"$rows_left_out":1264}
{"sheet":"Reference","index":21,"n_rows":35,"n_cols":25,"rows_kept":35,"cut":false,"hidden":true,"merged":[]}
[]
["Navn","Tekst","Løst",null,null,null,null,null,null,null,null,null,"Institution","Type","0.0","1.0","2.0","3.0",null,"Opgave","udfyld",null,"ARKNAVN","OPGAVE","LINK"]
["1.2",{"$f":"SUM(OFFSET(Opgave_1.2[Uddannelsesområde],0,-1))","v":34},{"$f":"B3>0","v":true},null,null,"Mellemgrupper",null,"Type udflytning",null,"Velfærdsuddannelser",null,null,"Arkitektskolen Aarhus","Kunstneriske og kulturelle uddannelsesinstitutioner",true,true,{"$f":"IF(OR(N3=\"Professionshøjskoler\",M3=\"Aalborg Universitet\"),TRUE,FALSE)","v":false},false,null,"0.0",null,null,"0.0","Overordnede overvejelser om opgaven",{"$f":"\"#\"&W3&\"!A1\"","v":"#0.0!A1"}]
["1.3",{"$f":"SUM(OFFSET(Opgave_1.3[Uddannelsesområde],0,-1))","v":0},{"$f":"B4>0","v":false},null,null,"Bio- og laboratorietekniske område, EA",null,"Udflytning",null,"Folkeskolelærer",null,null,"Copenhagen Business School - Handelshøjskolen","Universiteter",true,true,{"$f":"IF(OR(N4=\"Professionshøjskoler\",M4=\"Aalborg Universitet\"),TRUE,FALSE)","v":false},false,null,"1.1",null,null,"1.0","Indledning sektion 1","#1.0!A1"]
["1.4",{"$f":"SUM(OFFSET(Opgave_1.4[Uddannelsesområde],0,-1))","v":53},true,null,null,"Designfaglige område, EA",null,"Nye pladser",null,"Pædagog",null,null,"Danmarks Medie- og Journalisthøjskole","Professionshøjskoler",true,true,false,false,null,"1.2",null,null,"1.1","Ledelsesmæssige overvejelser","#1.1!A1"]
["1.6",{"$f":"SUM(OFFSET(Opgave_1.6[Beskrivelse],0,-1))","v":12},true,null,null,"It-faglige område, EA",null,null,null,"Socialrådgiver",null,null,"Danmarks Tekniske Universitet","Universiteter",true,true,{"$f":"IF(OR(N6=\"Professionshøjskoler\",M6=\"Aalborg Universitet\"),TRUE,FALSE)","v":false},false,null,"1.3",null,null,"1.2","Antal pladser der flyttes ud","#1.2!A1"]
["1.8",{"$f":"SUM(OFFSET(Opgave_1.8[Uddannelsesområde],0,-1))","v":20},true,null,null,"Samfundsfaglige område, EA",null,null,null,"Sygeplejerske",null,null,"Designskolen Kolding","Kunstneriske og kulturelle uddannelsesinstitutioner",true,false,false,true,null,"1.4",null,null,"1.3","Antal pladser på nye udbud","#1.3!A1"]
["2.2",{"$f":"SUM(OFFSET(Opgave_2.2[Uddannelse],0,-1))","v":0},false,null,null,"Tekniske område, EA",null,null,null,null,null,null,"Det Kongelige Akademi - Arkitektur, Design, Konservering","Kunstneriske og kulturelle uddannelsesinstitutioner",true,true,false,false,null,"1.5",null,null,"1.4","Antal pladser der nedskaleres","#1.4!A1"]
["3.1",{"$f":"SUM(OFFSET(Opgave_3.1[Uddannelse],0,-1))","v":0},false,null,null,"Økonomisk-merkantile område, EA",null,null,null,null,null,null,"Erhvervsakademi Dania","Erhvervsakademier",true,false,false,true,null,"1.6",null,null,"1.5","Beskrivelse af regionale elementer","#1.5!A1"]
["0.0","Udfyldt",{"$f":"AND(LEN(B10)>0,B10<>\"[Udfyld her]\")","v":true},null,null,"Sundhedsfaglige område, EA",null,null,null,null,null,null,"Erhvervsakademi MidtVest","Erhvervsakademier",true,false,false,true,null,"1.7",null,null,"1.6","Tabel med regionale elementer","#1.6!A1"]
{"$rows_left_out":25}